{"text_format":"1","workbook":"xlsx","n_sheets":3,"sheets":["Sabit","Vakitler","İmsakiye 2022"],"not_rendered":{"charts":2,"images":8,"macros":1,"external_links":0,"defined_names":1,"comments":0,"pivot_tables":0},"unopened":[],"bounds":{"document_bytes":16777216,"sheet_cells":100000,"rows_first":2000,"rows_last":500,"rows_between":2000,"halvings":0,"cell_chars":16384,"cell_head_chars":4096},"cells_cut":0,"cells_raw":0,"read":"whole","date_system":"1900"}

{"sheet":"Sabit","index":0,"n_rows":82,"n_cols":8,"rows_kept":82,"cut":false,"hidden":true,"merged":[]}
["İLLER","Bayram Namazı","Seçimler",null,null,null," 02 Mayıs 2022 Pazartesi Ramazan Bayramının 1.Günüdür  \r\n\r\nBayram Namazı :06:34  "]
["Adana","06:14:00","İstanbul","Şehir",null,null,"BAYRAM"," 02 Mayıs 2022 Pazartesi"]
["Adıyaman","06:02:00",{"$f":"MATCH(C2,Vakitler!A:A,0)","v":41},"Satır",null,null,"BAYRAM SAAT","06:34:00"]
["Afyonkarahisar","06:31:00",{"$f":"H3","v":"06:34:00"},"Namaz",null,null,"KADiR GECESi","2022-04-27"]
["Ağrı","05:40:00",null,null,null,null,"FiTRE"]
["Aksaray","06:18:00","Günlük",{"$f":"TODAY()","v":"2022-04-07"}]
["Amasya","06:07:00",{"$f":"NOW()","v":44658.977764930554},"bugün"]
["Ankara","06:20:00",{"$f":"IFERROR(VLOOKUP(D6,'İmsakiye 2022'!A:B,2,0)+1,0)","v":7},"Gün Satır"]
["Antalya","06:33:00",{"$f":"IFERROR(INDIRECT(\"İmsakiye!E\"&C8),0)","v":"00:00:00"},"iftar"]
["Ardahan","05:39:00",{"$f":"IFERROR(INDIRECT(\"İmsakiye!D\"&C8),0)","v":"00:00:00"},"sahur"]
["Artvin","05:42:00",{"$f":"IF(C7>C9,C9-C10,C7-C10)","v":"00:00:00"},"Tutulan Süre"]
["Aydın","06:43:00",{"$f":"IF(C7>C9,0,C9-C7)","v":"00:00:00"},"Kalan Süre"]
["Balıkesir","06:40:00",{"$f":"IF(C8=0,0,C8-1)","v":6},"Tutulan Gün"]
["Bartın","06:20:00",{"$f":"30-C13","v":24},"Kalan Gün"]
["Batman","05:50:00"]
["Bayburt","05:50:00"]
["Bilecik","06:31:00"]
["Bingöl","05:51:00"]
["Bitlis","05:45:00"]
["Bolu","06:24:00"]
["Burdur","06:34:00"]
["Bursa","06:35:00"]
["Çanakkale","06:46:00"]
["Çankırı","06:16:00"]
["Çorum","06:11:00"]
["Denizli","06:38:00"]
["Diyarbakır","05:54:00"]
["Düzce","06:24:00"]
["Edirne","06:43:00"]
["Elazığ","05:57:00"]
["Erzincan","05:54:00"]
["Erzurum","05:46:00"]
["Eskişehir","06:30:00"]
["Gaziantep","06:06:00"]
["Giresun","05:56:00"]
["Gümüşhane","05:53:00"]
["Hakkâri","05:40:00"]
["Hatay","06:12:00"]
["Iğdır","05:53:00"]
["Isparta","06:32:00"]
["İstanbul","06:34:00"]
["İzmir","06:45:00"]
["Kahramanmaraş","06:07:00"]
["Karabük","06:19:00"]
["Karaman","06:23:00"]
["Kars","05:38:00"]
["Kastamonu","06:14:00"]
["Kayseri","06:11:00"]
["Kırıkkale","06:18:00"]
["Kırklareli","06:40:00"]
["Kırşehir","06:16:00"]
["Kilis","06:08:00"]
["Kocaeli","06:31:00"]
["Konya","06:25:00"]
["Kütahya","06:23:00"]
["Malatya","06:01:00"]
["Manisa","06:44:00"]
["Mardin","05:52:00"]
["Mersin","06:17:00"]
["Muğla","06:42:00"]
["Muş","05:47:00"]
["Nevşehir","06:15:00"]
["Niğde","06:16:00"]
["Ordu","05:58:00"]
["Osmaniye","06:11:00"]
["Rize","05:48:00"]
["Sakarya","06:29:00"]
["Samsun","06:04:00"]
["Siirt","06:00:00"]
["Sinop","06:08:00"]
["Sivas","06:04:00"]
["Şanlıurfa","06:00:00"]
["Şırnak","05:45:00"]
["Tekirdağ","06:40:00"]
["Tokat","06:05:00"]
["Trabzon","05:51:00"]
["Tunceli","05:55:00"]
["Uşak","06:36:00"]
["Van","05:40:00"]
["Yalova","06:33:00"]
["Yozgat","06:12:00"]
["Zonguldak","06:22:00"]

{"sheet":"Vakitler","index":1,"n_rows":82,"n_cols":1,"rows_kept":82,"cut":false,"hidden":true,"merged":[]}
["iller"]
["ADANA"]
["ADIYAMAN"]
["AFYONKARAHİSAR"]
["AĞRI"]
["AKSARAY"]
["AMASYA"]
["ANKARA"]
["ANTALYA"]
["ARDAHAN"]
["ARTVİN"]
["AYDIN"]
["BALIKESİR"]
["BARTIN"]
["BATMAN"]
["BAYBURT"]
["BİLECİK"]
["BİNGÖL"]
["BİTLİS"]
["BOLU"]
["BURDUR"]
["BURSA"]
["ÇANAKKALE"]
["ÇANKIRI"]
["ÇORUM"]
["DENİZLİ"]
["DİYARBAKIR"]
["DÜZCE"]
["EDİRNE"]
["ELAZIĞ"]
["ERZİNCAN"]
["ERZURUM"]
["ESKİŞEHİR"]
["GAZİANTEP"]
["GİRESUN"]
["GÜMÜŞHANE"]
["HAKKARİ"]
["HATAY"]
["IĞDIR"]
["ISPARTA"]
["İSTANBUL"]
["İZMİR"]
["KAHRAMANMARAŞ"]
["KARABÜK"]
["KARAMAN"]
["KARS"]
["KASTAMONU"]
["KAYSERİ"]
["KİLİS"]
["KIRIKKALE"]
["KIRKLARELİ"]
["KIRŞEHİR"]
["KOCAELİ"]
["KONYA"]
["KÜTAHYA"]
["MALATYA"]
["MANİSA"]
["MARDİN"]
["MERSİN"]
["MUĞLA"]
["MUŞ"]
["NEVŞEHİR"]
["NİĞDE"]
["ORDU"]
["OSMANİYE"]
["RİZE"]
["SAKARYA"]
["SAMSUN"]
["ŞANLIURFA"]
["SİİRT"]
["SİNOP"]
["ŞIRNAK"]
["SİVAS"]
["TEKİRDAĞ"]
["TOKAT"]
["TRABZON"]
["TUNCELİ"]
["UŞAK"]
["VAN"]
["YALOVA"]
["YOZGAT"]
["ZONGULDAK"]

{"sheet":"İmsakiye 2022","index":2,"n_rows":34,"n_cols":16,"rows_kept":34,"cut":false,"hidden":false,"merged":[[28,15,30,19]]}
["TARİH","ORUÇLU GÜN","KALAN GÜN","SAHUR VAKTİ","İFTAR VAKTİ","İFTARA KALAN SÜRE"]
["2022-04-02",1,{"$f":"30-B2","v":29},44653.216666666667,44653.816666666666,{"$f":"IF(A2=\"\",\"\",IF(NOW()>E2,\"Allah Kabul Etsin... :)\",IF(D2>NOW(),\"\",E2-NOW())))","v":"Allah Kabul Etsin... :)"}]
["2022-04-03",2,{"$f":"30-B3","v":28},44654.215277777781,44654.817361111112,{"$f":"IF(A3=\"\",\"\",IF(NOW()>E3,\"Allah Kabul Etsin... :)\",IF(D3>NOW(),\"\",E3-NOW())))","v":"Allah Kabul Etsin... :)"}]
["2022-04-04",3,27,44655.213888888888,44655.818055555559,"Allah Kabul Etsin... :)"]
["2022-04-05",4,26,44656.212500000001,44656.818749999999,"Allah Kabul Etsin... :)"]
["2022-04-06",5,25,44657.211111111108,44657.819444444445,"Allah Kabul Etsin... :)"]
["2022-04-07",6,24,44658.209722222222,44658.820138888892,"Allah Kabul Etsin... :)"]
["2022-04-08",7,23,44659.208333333336,44659.821527777778,""]
["2022-04-09",8,22,44660.207638888889,44660.822222222225,""]
["2022-04-10",9,21,44661.206250000003,44661.822916666664,""]
["2022-04-11",10,20,44662.204861111109,44662.823611111111,""]
["2022-04-12",11,19,44663.203472222223,44663.824305555558,""]
["2022-04-13",12,18,44664.20208333333,44664.824999999997,""]
["2022-04-14",13,17,44665.200694444444,44665.825694444444,""]
["2022-04-15",14,16,44666.199305555558,44666.826388888891,""]
["2022-04-16",15,15,44667.197916666664,44667.82708333333,""]
["2022-04-17",16,14,44668.196527777778,44668.827777777777,""]
["2022-04-18",17,13,44669.195138888892,44669.828472222223,""]
["2022-04-19",18,12,44670.193749999999,44670.82916666667,""]
["2022-04-20",19,11,44671.192361111112,44671.829861111109,""]
["2022-04-21",20,10,44672.191666666666,44672.830555555556,""]
["2022-04-22",21,9,44673.19027777778,44673.831250000003,""]
["2022-04-23",22,8,44674.188888888886,44674.831944444442,""]
["2022-04-24",23,7,44675.1875,44675.833333333336,""]
["2022-04-25",24,6,44676.186111111114,44676.834027777775,""]
["2022-04-26",25,5,44677.18472222222,44677.834722222222,""]
["2022-04-27",26,4,44678.183333333334,44678.835416666669,""]
["2022-04-28",27,3,44679.181944444441,44679.836111111108,""]
["2022-04-29",28,2,44680.181250000001,44680.836805555555,"",null,null,null,null,null,null,null,null,null,{"$f":"NOW()","v":"2022-04-07T23:27:58.890"}]
["2022-04-30",29,1,44681.179861111108,44681.837500000001,""]
["2022-05-01",30,0,44682.178472222222,44682.838194444441,""]
[]
[]
["İSTANBUL >>>>> İSTANBUL İmsakiye"]