{"text_format":"1","workbook":"xlsx","n_sheets":3,"sheets":["Sabit","Vakitler","İmsakiye"],"not_rendered":{"charts":2,"images":4,"macros":1,"external_links":0,"defined_names":0,"comments":0,"pivot_tables":0},"unopened":[],"bounds":{"document_bytes":16777216,"sheet_cells":100000,"rows_first":2000,"rows_last":500,"rows_between":2000,"halvings":0,"cell_chars":16384,"cell_head_chars":4096},"cells_cut":0,"cells_raw":0,"read":"whole","date_system":"1900"}

{"sheet":"Sabit","index":0,"n_rows":82,"n_cols":4,"rows_kept":82,"cut":false,"hidden":false,"merged":[]}
["İLLER","Bayram Namazı","Seçimler"]
["Adana","06:14:00","İstanbul","Şehir"]
["Adıyaman","06:02:00",{"$f":"MATCH(C2,Vakitler!A:A,0)","v":1172},"Satır"]
["Afyonkarahisar","06:31:00",{"$f":"VLOOKUP(C2,A:B,2,0)","v":"06:34:00"},"Namaz"]
["Ağrı","05:40:00"]
["Aksaray","06:18:00","Günlük",{"$f":"TODAY()","v":"2022-04-01"}]
["Amasya","06:07:00",{"$f":"NOW()","v":44652.788493981483},"bugün"]
["Ankara","06:20:00",{"$f":"IFERROR(VLOOKUP(D6,İmsakiye!A:B,2,0)+1,0)","v":0},"Gün Satır"]
["Antalya","06:33:00",{"$f":"IFERROR(INDIRECT(\"İmsakiye!E\"&C8),0)","v":"00:00:00"},"iftar"]
["Ardahan","05:39:00",{"$f":"IFERROR(INDIRECT(\"İmsakiye!D\"&C8),0)","v":"00:00:00"},"sahur"]
["Artvin","05:42:00",{"$f":"IF(C7>C9,C9-C10,C7-C10)","v":"00:00:00"},"Tutulan Süre"]
["Aydın","06:43:00",{"$f":"IF(C7>C9,0,C9-C7)","v":"00:00:00"},"Kalan Süre"]
["Balıkesir","06:40:00",{"$f":"IF(C8=0,0,C8-1)","v":0},"Tutulan Gün"]
["Bartın","06:20:00",{"$f":"30-C13","v":30},"Kalan Gün"]
["Batman","05:50:00"]
["Bayburt","05:50:00"]
["Bilecik","06:31:00"]
["Bingöl","05:51:00"]
["Bitlis","05:45:00"]
["Bolu","06:24:00"]
["Burdur","06:34:00"]
["Bursa","06:35:00"]
["Çanakkale","06:46:00"]
["Çankırı","06:16:00"]
["Çorum","06:11:00"]
["Denizli","06:38:00"]
["Diyarbakır","05:54:00"]
["Düzce","06:24:00"]
["Edirne","06:43:00"]
["Elazığ","05:57:00"]
["Erzincan","05:54:00"]
["Erzurum","05:46:00"]
["Eskişehir","06:30:00"]
["Gaziantep","06:06:00"]
["Giresun","05:56:00"]
["Gümüşhane","05:53:00"]
["Hakkâri","05:40:00"]
["Hatay","06:12:00"]
["Iğdır","05:53:00"]
["Isparta","06:32:00"]
["İstanbul","06:34:00"]
["İzmir","06:45:00"]
["Kahramanmaraş","06:07:00"]
["Karabük","06:19:00"]
["Karaman","06:23:00"]
["Kars","05:38:00"]
["Kastamonu","06:14:00"]
["Kayseri","06:11:00"]
["Kırıkkale","06:18:00"]
["Kırklareli","06:40:00"]
["Kırşehir","06:16:00"]
["Kilis","06:08:00"]
["Kocaeli","06:31:00"]
["Konya","06:25:00"]
["Kütahya","06:23:00"]
["Malatya","06:01:00"]
["Manisa","06:44:00"]
["Mardin","05:52:00"]
["Mersin","06:17:00"]
["Muğla","06:42:00"]
["Muş","05:47:00"]
["Nevşehir","06:15:00"]
["Niğde","06:16:00"]
["Ordu","05:58:00"]
["Osmaniye","06:11:00"]
["Rize","05:48:00"]
["Sakarya","06:29:00"]
["Samsun","06:04:00"]
["Siirt","06:00:00"]
["Sinop","06:08:00"]
["Sivas","06:04:00"]
["Şanlıurfa","06:00:00"]
["Şırnak","05:45:00"]
["Tekirdağ","06:40:00"]
["Tokat","06:05:00"]
["Trabzon","05:51:00"]
["Tunceli","05:55:00"]
["Uşak","06:36:00"]
["Van","05:40:00"]
["Yalova","06:33:00"]
["Yozgat","06:12:00"]
["Zonguldak","06:22:00"]

{"sheet":"Vakitler","index":1,"n_rows":2431,"n_cols":4,"rows_kept":2431,"cut":false,"hidden":false,"merged":[]}
["İL","Tarih","Sahur","İftar"]
["ADANA","2022-04-02",44653.204861111109,44653.797222222223]
["ADANA","2022-04-03",44654.203472222223,44654.79791666667]
["ADANA","2022-04-04",44655.202777777777,44655.798611111109]
["ADANA","2022-04-05",44656.201388888891,44656.799305555556]
["ADANA","2022-04-06",44657.2,44657.8]
["ADANA","2022-04-07",44658.199305555558,44658.800694444442]
["ADANA","2022-04-08",44659.197916666664,44659.801388888889]
["ADANA","2022-04-09",44660.196527777778,44660.801388888889]
["ADANA","2022-04-10",44661.195833333331,44661.802083333336]
["ADANA","2022-04-11",44662.194444444445,44662.802777777775]
["ADANA","2022-04-12",44663.193055555559,44663.803472222222]
["ADANA","2022-04-13",44664.192361111112,44664.804166666669]
["ADANA","2022-04-14",44665.190972222219,44665.804861111108]
["ADANA","2022-04-15",44666.189583333333,44666.805555555555]
["ADANA","2022-04-16",44667.188888888886,44667.806250000001]
["ADANA","2022-04-17",44668.1875,44668.806250000001]
["ADANA","2022-04-18",44669.186111111114,44669.806944444441]
["ADANA","2022-04-19",44670.185416666667,44670.807638888888]
["ADANA","2022-04-20",44671.184027777781,44671.808333333334]
["ADANA","2022-04-21",44672.182638888888,44672.809027777781]
["ADANA","2022-04-22",44673.181944444441,44673.80972222222]
["ADANA","2022-04-23",44674.180555555555,44674.810416666667]
["ADANA","2022-04-24",44675.179861111108,44675.811111111114]
["ADANA","2022-04-25",44676.178472222222,44676.811805555553]
["ADANA","2022-04-26",44677.177083333336,44677.811805555553]
["ADANA","2022-04-27",44678.176388888889,44678.8125]
["ADANA","2022-04-28",44679.175000000003,44679.813194444447]
["ADANA","2022-04-29",44680.174305555556,44680.813888888886]
["ADANA","2022-04-30",44681.17291666667,44681.814583333333]
["ADANA","2022-05-01",44682.172222222223,44682.81527777778]
["ADIYAMAN","2022-04-02",44653.195833333331,44653.789583333331]
["ADIYAMAN","2022-04-03",44654.194444444445,44654.790277777778]
["ADIYAMAN","2022-04-04",44655.193055555559,44655.790972222225]
["ADIYAMAN","2022-04-05",44656.192361111112,44656.791666666664]
["ADIYAMAN","2022-04-06",44657.190972222219,44657.792361111111]
["ADIYAMAN","2022-04-07",44658.189583333333,44658.793055555558]
["ADIYAMAN","2022-04-08",44659.188194444447,44659.793055555558]
["ADIYAMAN","2022-04-09",44660.1875,44660.793749999997]
["ADIYAMAN","2022-04-10",44661.186111111114,44661.794444444444]
["ADIYAMAN","2022-04-11",44662.18472222222,44662.795138888891]
["ADIYAMAN","2022-04-12",44663.184027777781,44663.79583333333]
["ADIYAMAN","2022-04-13",44664.182638888888,44664.796527777777]
["ADIYAMAN","2022-04-14",44665.181250000001,44665.797222222223]
["ADIYAMAN","2022-04-15",44666.179861111108,44666.79791666667]
["ADIYAMAN","2022-04-16",44667.179166666669,44667.798611111109]
["ADIYAMAN","2022-04-17",44668.177777777775,44668.799305555556]
["ADIYAMAN","2022-04-18",44669.176388888889,44669.8]
["ADIYAMAN","2022-04-19",44670.175694444442,44670.8]
["ADIYAMAN","2022-04-20",44671.174305555556,44671.800694444442]
["ADIYAMAN","2022-04-21",44672.17291666667,44672.801388888889]
["ADIYAMAN","2022-04-22",44673.172222222223,44673.802083333336]
["ADIYAMAN","2022-04-23",44674.17083333333,44674.802777777775]
["ADIYAMAN","2022-04-24",44675.169444444444,44675.803472222222]
["ADIYAMAN","2022-04-25",44676.168749999997,44676.804166666669]
["ADIYAMAN","2022-04-26",44677.167361111111,44677.804861111108]
["ADIYAMAN","2022-04-27",44678.165972222225,44678.805555555555]
["ADIYAMAN","2022-04-28",44679.165277777778,44679.806250000001]
["ADIYAMAN","2022-04-29",44680.163888888892,44680.806944444441]
["ADIYAMAN","2022-04-30",44681.163194444445,44681.807638888888]
["ADIYAMAN","2022-05-01",44682.161805555559,44682.808333333334]
["AFYONKARAHİSAR",44653,44653.21597222222,44653.811111111114]
["AFYONKARAHİSAR",44654,44654.214583333334,44654.811805555553]
["AFYONKARAHİSAR",44655,44655.213194444441,44655.8125]
["AFYONKARAHİSAR",44656,44656.211805555555,44656.813194444447]
["AFYONKARAHİSAR",44657,44657.211111111108,44657.813888888886]
["AFYONKARAHİSAR",44658,44658.209722222222,44658.814583333333]
["AFYONKARAHİSAR",44659,44659.208333333336,44659.81527777778]
["AFYONKARAHİSAR",44660,44660.206944444442,44660.815972222219]
["AFYONKARAHİSAR",44661,44661.205555555556,44661.816666666666]
["AFYONKARAHİSAR",44662,44662.204861111109,44662.817361111112]
["AFYONKARAHİSAR",44663,44663.203472222223,44663.818055555559]
["AFYONKARAHİSAR",44664,44664.20208333333,44664.818749999999]
["AFYONKARAHİSAR",44665,44665.200694444444,44665.819444444445]
["AFYONKARAHİSAR",44666,44666.2,44666.820138888892]
["AFYONKARAHİSAR",44667,44667.198611111111,44667.820833333331]
["AFYONKARAHİSAR",44668,44668.197222222225,44668.821527777778]
["AFYONKARAHİSAR",44669,44669.195833333331,44669.822222222225]
["AFYONKARAHİSAR",44670,44670.195138888892,44670.822916666664]
["AFYONKARAHİSAR",44671,44671.193749999999,44671.823611111111]
["AFYONKARAHİSAR",44672,44672.192361111112,44672.824305555558]
["AFYONKARAHİSAR",44673,44673.190972222219,44673.824999999997]
["AFYONKARAHİSAR",44674,44674.19027777778,44674.825694444444]
["AFYONKARAHİSAR",44675,44675.188888888886,44675.826388888891]
["AFYONKARAHİSAR",44676,44676.1875,44676.82708333333]
["AFYONKARAHİSAR",44677,44677.186805555553,44677.82708333333]
["AFYONKARAHİSAR",44678,44678.185416666667,44678.827777777777]
["AFYONKARAHİSAR",44679,44679.184027777781,44679.828472222223]
["AFYONKARAHİSAR",44680,44680.182638888888,44680.82916666667]
["AFYONKARAHİSAR",44681,44681.181944444441,44681.829861111109]
["AFYONKARAHİSAR",44682,44682.180555555555,44682.830555555556]
["AĞRI",44653,44653.179861111108,44653.777083333334]
["AĞRI",44654,44654.178472222222,44654.777777777781]
["AĞRI",44655,44655.177083333336,44655.77847222222]
["AĞRI",44656,44656.175694444442,44656.779166666667]
["AĞRI",44657,44657.174305555556,44657.779861111114]
["AĞRI",44658,44658.17291666667,44658.780555555553]
["AĞRI",44659,44659.172222222223,44659.78125]
["AĞRI",44660,44660.17083333333,44660.781944444447]
["AĞRI",44661,44661.169444444444,44661.782638888886]
["AĞRI",44662,44662.168055555558,44662.783333333333]
["AĞRI",44663,44663.166666666664,44663.78402777778]
["AĞRI",44664,44664.165277777778,44664.784722222219]
["AĞRI",44665,44665.164583333331,44665.785416666666]
["AĞRI",44666,44666.163194444445,44666.786111111112]
["AĞRI",44667,44667.161805555559,44667.786805555559]
["AĞRI",44668,44668.160416666666,44668.787499999999]
["AĞRI",44669,44669.15902777778,44669.788194444445]
["AĞRI",44670,44670.157638888886,44670.788888888892]
["AĞRI",44671,44671.156944444447,44671.789583333331]
["AĞRI",44672,44672.155555555553,44672.790277777778]
["AĞRI",44673,44673.154166666667,44673.790972222225]
["AĞRI",44674,44674.152777777781,44674.791666666664]
["AĞRI",44675,44675.151388888888,44675.792361111111]
["AĞRI",44676,44676.150694444441,44676.793055555558]
["AĞRI",44677,44677.149305555555,44677.793749999997]
["AĞRI",44678,44678.147916666669,44678.794444444444]
["AĞRI",44679,44679.146527777775,44679.795138888891]
["AĞRI",44680,44680.145833333336,44680.79583333333]
["AĞRI",44681,44681.144444444442,44681.796527777777]
["AĞRI",44682,44682.143055555556,44682.797222222223]
["AKSARAY",44653,44653.206250000003,44653.801388888889]
["AKSARAY",44654,44654.205555555556,44654.802083333336]
["AKSARAY",44655,44655.20416666667,44655.802777777775]
["AKSARAY",44656,44656.202777777777,44656.803472222222]
["AKSARAY",44657,44657.201388888891,44657.804166666669]
["AKSARAY",44658,44658.200694444444,44658.804861111108]
["AKSARAY",44659,44659.199305555558,44659.805555555555]
["AKSARAY",44660,44660.197916666664,44660.806250000001]
["AKSARAY",44661,44661.196527777778,44661.806944444441]
["AKSARAY",44662,44662.195833333331,44662.807638888888]
["AKSARAY",44663,44663.194444444445,44663.808333333334]
["AKSARAY",44664,44664.193055555559,44664.809027777781]
["AKSARAY",44665,44665.191666666666,44665.80972222222]
["AKSARAY",44666,44666.190972222219,44666.80972222222]
["AKSARAY",44667,44667.189583333333,44667.810416666667]
["AKSARAY",44668,44668.188194444447,44668.811111111114]
["AKSARAY",44669,44669.1875,44669.811805555553]
["AKSARAY",44670,44670.186111111114,44670.8125]
["AKSARAY",44671,44671.18472222222,44671.813194444447]
["AKSARAY",44672,44672.183333333334,44672.813888888886]
["AKSARAY",44673,44673.182638888888,44673.814583333333]
["AKSARAY",44674,44674.181250000001,44674.81527777778]
["AKSARAY",44675,44675.179861111108,44675.815972222219]
["AKSARAY",44676,44676.179166666669,44676.816666666666]
["AKSARAY",44677,44677.177777777775,44677.817361111112]
["AKSARAY",44678,44678.176388888889,44678.818055555559]
["AKSARAY",44679,44679.175694444442,44679.818749999999]
["AKSARAY",44680,44680.174305555556,44680.819444444445]
["AKSARAY",44681,44681.17291666667,44681.820138888892]
["AKSARAY",44682,44682.172222222223,44682.820833333331]
["AMASYA",44653,44653.197916666664,44653.79791666667]
["AMASYA",44654,44654.196527777778,44654.798611111109]
["AMASYA",44655,44655.195833333331,44655.799305555556]
["AMASYA",44656,44656.194444444445,44656.800000000003]
["AMASYA",44657,44657.193055555559,44657.800694444442]
["AMASYA",44658,44658.191666666666,44658.801388888889]
["AMASYA",44659,44659.19027777778,44659.802083333336]
["AMASYA",44660,44660.188888888886,44660.802777777775]
["AMASYA",44661,44661.1875,44661.803472222222]
["AMASYA",44662,44662.186111111114,44662.804166666669]
["AMASYA",44663,44663.18472222222,44663.804861111108]
["AMASYA",44664,44664.184027777781,44664.805555555555]
["AMASYA",44665,44665.182638888888,44665.806250000001]
["AMASYA",44666,44666.181250000001,44666.806944444441]
["AMASYA",44667,44667.179861111108,44667.807638888888]
["AMASYA",44668,44668.178472222222,44668.808333333334]
["AMASYA",44669,44669.177083333336,44669.809027777781]
["AMASYA",44670,44670.175694444442,44670.80972222222]
["AMASYA",44671,44671.174305555556,44671.810416666667]
["AMASYA",44672,44672.17291666667,44672.811111111114]
["AMASYA",44673,44673.172222222223,44673.811805555553]
["AMASYA",44674,44674.17083333333,44674.8125]
["AMASYA",44675,44675.169444444444,44675.813888888886]
["AMASYA",44676,44676.168055555558,44676.814583333333]
["AMASYA",44677,44677.166666666664,44677.81527777778]
["AMASYA",44678,44678.165277777778,44678.815972222219]
["AMASYA",44679,44679.164583333331,44679.816666666666]
["AMASYA",44680,44680.163194444445,44680.817361111112]
["AMASYA",44681,44681.161805555559,44681.818055555559]
["AMASYA",44682,44682.160416666666,44682.818749999999]
["ANKARA",44653,44653.207638888889,44653.805555555555]
["ANKARA",44654,44654.206250000003,44654.806250000001]
["ANKARA",44655,44655.204861111109,44655.806944444441]
["ANKARA",44656,44656.203472222223,44656.807638888888]
["ANKARA",44657,44657.20208333333,44657.808333333334]
["ANKARA",44658,44658.201388888891,44658.809027777781]
["ANKARA",44659,44659.199999999997,44659.80972222222]
["ANKARA",44660,44660.198611111111,44660.810416666667]
["ANKARA",44661,44661.197222222225,44661.811111111114]
["ANKARA",44662,44662.195833333331,44662.811805555553]
["ANKARA",44663,44663.194444444445,44663.8125]
["ANKARA",44664,44664.193749999999,44664.813194444447]
["ANKARA",44665,44665.192361111112,44665.813888888886]
["ANKARA",44666,44666.190972222219,44666.814583333333]
["ANKARA",44667,44667.189583333333,44667.81527777778]
["ANKARA",44668,44668.188194444447,44668.815972222219]
["ANKARA",44669,44669.186805555553,44669.816666666666]
["ANKARA",44670,44670.185416666667,44670.817361111112]
["ANKARA",44671,44671.18472222222,44671.818055555559]
{"$rows_left_out":2232}
{"sheet":"İmsakiye","index":2,"n_rows":31,"n_cols":16,"rows_kept":31,"cut":false,"hidden":false,"merged":[[28,15,30,19]]}
["TARİH","ORUÇLU GÜN","KALAN GÜN","SAHUR VAKTİ","İFTAR VAKTİ","İFTARA KALAN SÜRE"]
["2022-04-02",1,{"$f":"30-B2","v":29},{"$f":"INDIRECT(\"Vakitler!C\"&Sabit!C3)","v":44653.216666666667},{"$f":"INDIRECT(\"Vakitler!D\"&Sabit!C3)","v":44653.816666666666},{"$f":"IF(NOW()>E2,\"Allah Kabul Etsin... :)\",IF(D2>NOW(),\"\",E2-NOW()))","v":""}]
[{"$f":"A2+1","v":"2022-04-03"},2,{"$f":"30-B3","v":28},{"$f":"INDIRECT(\"Vakitler!C\"&Sabit!$C$3+ROW(D1))","v":44654.215277777781},{"$f":"INDIRECT(\"Vakitler!D\"&Sabit!$C$3+ROW(E1))","v":44654.817361111112},{"$f":"IF(NOW()>E3,\"Allah Kabul Etsin... :)\",IF(D3>NOW(),\"\",E3-NOW()))","v":""}]
[{"$f":"A3+1","v":"2022-04-04"},3,27,{"$f":"INDIRECT(\"Vakitler!C\"&Sabit!$C$3+ROW(D2))","v":44655.213888888888},{"$f":"INDIRECT(\"Vakitler!D\"&Sabit!$C$3+ROW(E2))","v":44655.818055555559},""]
["2022-04-05",4,26,{"$f":"INDIRECT(\"Vakitler!C\"&Sabit!$C$3+ROW(D3))","v":44656.212500000001},{"$f":"INDIRECT(\"Vakitler!D\"&Sabit!$C$3+ROW(E3))","v":44656.818749999999},""]
["2022-04-06",5,25,{"$f":"INDIRECT(\"Vakitler!C\"&Sabit!$C$3+ROW(D4))","v":44657.211111111108},{"$f":"INDIRECT(\"Vakitler!D\"&Sabit!$C$3+ROW(E4))","v":44657.819444444445},""]
["2022-04-07",6,24,{"$f":"INDIRECT(\"Vakitler!C\"&Sabit!$C$3+ROW(D5))","v":44658.209722222222},{"$f":"INDIRECT(\"Vakitler!D\"&Sabit!$C$3+ROW(E5))","v":44658.820138888892},""]
["2022-04-08",7,23,{"$f":"INDIRECT(\"Vakitler!C\"&Sabit!$C$3+ROW(D6))","v":44659.208333333336},{"$f":"INDIRECT(\"Vakitler!D\"&Sabit!$C$3+ROW(E6))","v":44659.821527777778},""]
["2022-04-09",8,22,{"$f":"INDIRECT(\"Vakitler!C\"&Sabit!$C$3+ROW(D7))","v":44660.207638888889},{"$f":"INDIRECT(\"Vakitler!D\"&Sabit!$C$3+ROW(E7))","v":44660.822222222225},""]
["2022-04-10",9,21,{"$f":"INDIRECT(\"Vakitler!C\"&Sabit!$C$3+ROW(D8))","v":44661.206250000003},{"$f":"INDIRECT(\"Vakitler!D\"&Sabit!$C$3+ROW(E8))","v":44661.822916666664},""]
["2022-04-11",10,20,{"$f":"INDIRECT(\"Vakitler!C\"&Sabit!$C$3+ROW(D9))","v":44662.204861111109},{"$f":"INDIRECT(\"Vakitler!D\"&Sabit!$C$3+ROW(E9))","v":44662.823611111111},""]
["2022-04-12",11,19,{"$f":"INDIRECT(\"Vakitler!C\"&Sabit!$C$3+ROW(D10))","v":44663.203472222223},{"$f":"INDIRECT(\"Vakitler!D\"&Sabit!$C$3+ROW(E10))","v":44663.824305555558},""]
["2022-04-13",12,18,{"$f":"INDIRECT(\"Vakitler!C\"&Sabit!$C$3+ROW(D11))","v":44664.20208333333},{"$f":"INDIRECT(\"Vakitler!D\"&Sabit!$C$3+ROW(E11))","v":44664.824999999997},""]
["2022-04-14",13,17,{"$f":"INDIRECT(\"Vakitler!C\"&Sabit!$C$3+ROW(D12))","v":44665.200694444444},{"$f":"INDIRECT(\"Vakitler!D\"&Sabit!$C$3+ROW(E12))","v":44665.825694444444},""]
["2022-04-15",14,16,{"$f":"INDIRECT(\"Vakitler!C\"&Sabit!$C$3+ROW(D13))","v":44666.199305555558},{"$f":"INDIRECT(\"Vakitler!D\"&Sabit!$C$3+ROW(E13))","v":44666.826388888891},""]
["2022-04-16",15,15,{"$f":"INDIRECT(\"Vakitler!C\"&Sabit!$C$3+ROW(D14))","v":44667.197916666664},{"$f":"INDIRECT(\"Vakitler!D\"&Sabit!$C$3+ROW(E14))","v":44667.82708333333},""]
["2022-04-17",16,14,{"$f":"INDIRECT(\"Vakitler!C\"&Sabit!$C$3+ROW(D15))","v":44668.196527777778},{"$f":"INDIRECT(\"Vakitler!D\"&Sabit!$C$3+ROW(E15))","v":44668.827777777777},""]
["2022-04-18",17,13,{"$f":"INDIRECT(\"Vakitler!C\"&Sabit!$C$3+ROW(D16))","v":44669.195138888892},{"$f":"INDIRECT(\"Vakitler!D\"&Sabit!$C$3+ROW(E16))","v":44669.828472222223},""]
["2022-04-19",18,12,{"$f":"INDIRECT(\"Vakitler!C\"&Sabit!$C$3+ROW(D17))","v":44670.193749999999},{"$f":"INDIRECT(\"Vakitler!D\"&Sabit!$C$3+ROW(E17))","v":44670.82916666667},""]
["2022-04-20",19,11,{"$f":"INDIRECT(\"Vakitler!C\"&Sabit!$C$3+ROW(D18))","v":44671.192361111112},{"$f":"INDIRECT(\"Vakitler!D\"&Sabit!$C$3+ROW(E18))","v":44671.829861111109},""]
["2022-04-21",20,10,{"$f":"INDIRECT(\"Vakitler!C\"&Sabit!$C$3+ROW(D19))","v":44672.191666666666},{"$f":"INDIRECT(\"Vakitler!D\"&Sabit!$C$3+ROW(E19))","v":44672.830555555556},""]
["2022-04-22",21,9,{"$f":"INDIRECT(\"Vakitler!C\"&Sabit!$C$3+ROW(D20))","v":44673.19027777778},{"$f":"INDIRECT(\"Vakitler!D\"&Sabit!$C$3+ROW(E20))","v":44673.831250000003},""]
["2022-04-23",22,8,{"$f":"INDIRECT(\"Vakitler!C\"&Sabit!$C$3+ROW(D21))","v":44674.188888888886},{"$f":"INDIRECT(\"Vakitler!D\"&Sabit!$C$3+ROW(E21))","v":44674.831944444442},""]
["2022-04-24",23,7,{"$f":"INDIRECT(\"Vakitler!C\"&Sabit!$C$3+ROW(D22))","v":44675.1875},{"$f":"INDIRECT(\"Vakitler!D\"&Sabit!$C$3+ROW(E22))","v":44675.833333333336},""]
["2022-04-25",24,6,{"$f":"INDIRECT(\"Vakitler!C\"&Sabit!$C$3+ROW(D23))","v":44676.186111111114},{"$f":"INDIRECT(\"Vakitler!D\"&Sabit!$C$3+ROW(E23))","v":44676.834027777775},""]
["2022-04-26",25,5,{"$f":"INDIRECT(\"Vakitler!C\"&Sabit!$C$3+ROW(D24))","v":44677.18472222222},{"$f":"INDIRECT(\"Vakitler!D\"&Sabit!$C$3+ROW(E24))","v":44677.834722222222},""]
["2022-04-27",26,4,{"$f":"INDIRECT(\"Vakitler!C\"&Sabit!$C$3+ROW(D25))","v":44678.183333333334},{"$f":"INDIRECT(\"Vakitler!D\"&Sabit!$C$3+ROW(E25))","v":44678.835416666669},""]
["2022-04-28",27,3,{"$f":"INDIRECT(\"Vakitler!C\"&Sabit!$C$3+ROW(D26))","v":44679.181944444441},{"$f":"INDIRECT(\"Vakitler!D\"&Sabit!$C$3+ROW(E26))","v":44679.836111111108},""]
["2022-04-29",28,2,{"$f":"INDIRECT(\"Vakitler!C\"&Sabit!$C$3+ROW(D27))","v":44680.181250000001},{"$f":"INDIRECT(\"Vakitler!D\"&Sabit!$C$3+ROW(E27))","v":44680.836805555555},"",null,null,null,null,null,null,null,null,null,{"$f":"NOW()","v":"2022-04-01T18:55:25.880"}]
["2022-04-30",29,1,{"$f":"INDIRECT(\"Vakitler!C\"&Sabit!$C$3+ROW(D28))","v":44681.179861111108},{"$f":"INDIRECT(\"Vakitler!D\"&Sabit!$C$3+ROW(E28))","v":44681.837500000001},""]
["2022-05-01",30,0,{"$f":"INDIRECT(\"Vakitler!C\"&Sabit!$C$3+ROW(D29))","v":44682.178472222222},{"$f":"INDIRECT(\"Vakitler!D\"&Sabit!$C$3+ROW(E29))","v":44682.838194444441},""]