{"text_format":"1","workbook":"xlsx","n_sheets":3,"sheets":["Sabit","Vakitler","İmsakiye"],"not_rendered":{"charts":2,"images":5,"macros":1,"external_links":0,"defined_names":0,"comments":0,"pivot_tables":0},"unopened":[],"bounds":{"document_bytes":16777216,"sheet_cells":100000,"rows_first":2000,"rows_last":500,"rows_between":2000,"halvings":0,"cell_chars":16384,"cell_head_chars":4096},"cells_cut":0,"cells_raw":0,"read":"whole","date_system":"1900"}

{"sheet":"Sabit","index":0,"n_rows":14,"n_cols":7,"rows_kept":14,"cut":false,"hidden":true,"merged":[]}
["İLLER","Bayram Namazı","Seçimler",null,null,"Bayram Günü","Kadir Gecesi"]
["ANDIRIN","06:23:00","ANDIRIN","Şehir","FİTRE BEDELİ: 70 TL","21 NİSAN 2023 CUMA","17 NİSAN 2023 PAZARTESİ"]
[null,null,{"$f":"MATCH(C2,Vakitler!A:A,0)","v":31},"Satır"]
[null,null,{"$f":"VLOOKUP(C2,A:B,2,0)","v":"06:23:00"},"Namaz"]
[]
[null,null,"Günlük",{"$f":"TODAY()","v":"2023-03-26"}]
[null,null,{"$f":"NOW()","v":45011.498139814816},"bugün"]
[null,null,{"$f":"IFERROR(VLOOKUP(D6,İmsakiye!A:B,2,0)+1,0)","v":5},"Gün Satır"]
[null,null,{"$f":"IFERROR(INDIRECT(\"İmsakiye!E\"&C8),0)","v":45011.790277777778},"iftar"]
[null,null,{"$f":"IFERROR(INDIRECT(\"İmsakiye!D\"&C8),0)","v":45011.209722222222},"sahur"]
[null,null,{"$f":"IF(C7>C9,C9-C10,C7-C10)","v":"06:55:19.280"},"Tutulan Süre"]
[null,null,{"$f":"IF(C7>C9,0,C9-C7)","v":"07:00:40.720"},"Kalan Süre"]
[null,null,{"$f":"IF(C8=0,0,C8-1)","v":4},"Tutulan Gün"]
[null,null,{"$f":"29-C13","v":25},"Kalan Gün"]

{"sheet":"Vakitler","index":1,"n_rows":291,"n_cols":4,"rows_kept":291,"cut":false,"hidden":true,"merged":[]}
["İL","Tarih","Sahur","İftar"]
["AFŞİN","2023-03-23",45008.211111111108,45008.786805555559]
["AFŞİN","2023-03-24",45009.209722222222,45009.787499999999]
["AFŞİN","2023-03-25",45010.208333333336,45010.788194444445]
["AFŞİN","2023-03-26",45011.207638888889,45011.788888888892]
["AFŞİN","2023-03-27",45012.206250000003,45012.789583333331]
["AFŞİN","2023-03-28",45013.204861111109,45013.790277777778]
["AFŞİN","2023-03-29",45014.203472222223,45014.790972222225]
["AFŞİN","2023-03-30",45015.202777777777,45015.791666666664]
["AFŞİN","2023-03-31",45016.201388888891,45016.792361111111]
["AFŞİN","2023-04-01",45017.2,45017.793055555558]
["AFŞİN","2023-04-02",45018.199305555558,45018.793055555558]
["AFŞİN","2023-04-03",45019.197916666664,45019.793749999997]
["AFŞİN","2023-04-04",45020.196527777778,45020.794444444444]
["AFŞİN","2023-04-05",45021.195138888892,45021.795138888891]
["AFŞİN","2023-04-06",45022.194444444445,45022.79583333333]
["AFŞİN","2023-04-07",45023.193055555559,45023.796527777777]
["AFŞİN","2023-04-08",45024.191666666666,45024.797222222223]
["AFŞİN","2023-04-09",45025.19027777778,45025.79791666667]
["AFŞİN","2023-04-10",45026.189583333333,45026.798611111109]
["AFŞİN","2023-04-11",45027.188194444447,45027.799305555556]
["AFŞİN","2023-04-12",45028.186805555553,45028.800000000003]
["AFŞİN","2023-04-13",45029.185416666667,45029.800694444442]
["AFŞİN","2023-04-14",45030.18472222222,45030.801388888889]
["AFŞİN","2023-04-15",45031.183333333334,45031.802083333336]
["AFŞİN","2023-04-16",45032.181944444441,45032.802777777775]
["AFŞİN","2023-04-17",45033.180555555555,45033.802777777775]
["AFŞİN","2023-04-18",45034.179861111108,45034.803472222222]
["AFŞİN","2023-04-19",45035.178472222222,45035.804166666669]
["AFŞİN","2023-04-20",45036.177083333336,45036.804861111108]
["ANDIRIN","2023-03-23",45008.213194444441,45008.788194444445]
["ANDIRIN","2023-03-24",45009.211805555555,45009.788888888892]
["ANDIRIN","2023-03-25",45010.211111111108,45010.789583333331]
["ANDIRIN","2023-03-26",45011.209722222222,45011.790277777778]
["ANDIRIN","2023-03-27",45012.208333333336,45012.790972222225]
["ANDIRIN","2023-03-28",45013.207638888889,45013.791666666664]
["ANDIRIN","2023-03-29",45014.206250000003,45014.792361111111]
["ANDIRIN","2023-03-30",45015.204861111109,45015.793055555558]
["ANDIRIN","2023-03-31",45016.20416666667,45016.793749999997]
["ANDIRIN","2023-04-01",45017.202777777777,45017.793749999997]
["ANDIRIN","2023-04-02",45018.201388888891,45018.794444444444]
["ANDIRIN","2023-04-03",45019.199999999997,45019.795138888891]
["ANDIRIN","2023-04-04",45020.199305555558,45020.79583333333]
["ANDIRIN","2023-04-05",45021.197916666664,45021.796527777777]
["ANDIRIN","2023-04-06",45022.196527777778,45022.797222222223]
["ANDIRIN","2023-04-07",45023.195833333331,45023.79791666667]
["ANDIRIN","2023-04-08",45024.194444444445,45024.798611111109]
["ANDIRIN","2023-04-09",45025.193055555559,45025.799305555556]
["ANDIRIN","2023-04-10",45026.192361111112,45026.8]
["ANDIRIN","2023-04-11",45027.190972222219,45027.8]
["ANDIRIN","2023-04-12",45028.189583333333,45028.800694444442]
["ANDIRIN","2023-04-13",45029.188194444447,45029.801388888889]
["ANDIRIN","2023-04-14",45030.1875,45030.802083333336]
["ANDIRIN","2023-04-15",45031.186111111114,45031.802777777775]
["ANDIRIN","2023-04-16",45032.18472222222,45032.803472222222]
["ANDIRIN","2023-04-17",45033.184027777781,45033.804166666669]
["ANDIRIN","2023-04-18",45034.182638888888,45034.804861111108]
["ANDIRIN","2023-04-19",45035.181250000001,45035.805555555555]
["ANDIRIN","2023-04-20",45036.180555555555,45036.806250000001]
["ÇAĞLAYANCERİT","2023-03-23",45008.210416666669,45008.786111111112]
["ÇAĞLAYANCERİT","2023-03-24",45009.209027777775,45009.786111111112]
["ÇAĞLAYANCERİT","2023-03-25",45010.208333333336,45010.786805555559]
["ÇAĞLAYANCERİT","2023-03-26",45011.206944444442,45011.787499999999]
["ÇAĞLAYANCERİT","2023-03-27",45012.205555555556,45012.788194444445]
["ÇAĞLAYANCERİT","2023-03-28",45013.204861111109,45013.788888888892]
["ÇAĞLAYANCERİT","2023-03-29",45014.203472222223,45014.789583333331]
["ÇAĞLAYANCERİT","2023-03-30",45015.20208333333,45015.790277777778]
["ÇAĞLAYANCERİT","2023-03-31",45016.200694444444,45016.790972222225]
["ÇAĞLAYANCERİT","2023-04-01",45017.2,45017.791666666664]
["ÇAĞLAYANCERİT","2023-04-02",45018.198611111111,45018.792361111111]
["ÇAĞLAYANCERİT","2023-04-03",45019.197222222225,45019.793055555558]
["ÇAĞLAYANCERİT","2023-04-04",45020.196527777778,45020.793055555558]
["ÇAĞLAYANCERİT","2023-04-05",45021.195138888892,45021.793749999997]
["ÇAĞLAYANCERİT","2023-04-06",45022.193749999999,45022.794444444444]
["ÇAĞLAYANCERİT","2023-04-07",45023.193055555559,45023.795138888891]
["ÇAĞLAYANCERİT","2023-04-08",45024.191666666666,45024.79583333333]
["ÇAĞLAYANCERİT","2023-04-09",45025.19027777778,45025.796527777777]
["ÇAĞLAYANCERİT","2023-04-10",45026.188888888886,45026.797222222223]
["ÇAĞLAYANCERİT","2023-04-11",45027.188194444447,45027.79791666667]
["ÇAĞLAYANCERİT","2023-04-12",45028.186805555553,45028.798611111109]
["ÇAĞLAYANCERİT","2023-04-13",45029.185416666667,45029.799305555556]
["ÇAĞLAYANCERİT","2023-04-14",45030.18472222222,45030.8]
["ÇAĞLAYANCERİT","2023-04-15",45031.183333333334,45031.800694444442]
["ÇAĞLAYANCERİT","2023-04-16",45032.181944444441,45032.800694444442]
["ÇAĞLAYANCERİT","2023-04-17",45033.180555555555,45033.801388888889]
["ÇAĞLAYANCERİT","2023-04-18",45034.179861111108,45034.802083333336]
["ÇAĞLAYANCERİT","2023-04-19",45035.178472222222,45035.802777777775]
["ÇAĞLAYANCERİT","2023-04-20",45036.177083333336,45036.803472222222]
["EKİNÖZÜ","2023-03-23",45008.210416666669,45008.786111111112]
["EKİNÖZÜ","2023-03-24",45009.209027777775,45009.786805555559]
["EKİNÖZÜ","2023-03-25",45010.207638888889,45010.787499999999]
["EKİNÖZÜ","2023-03-26",45011.206944444442,45011.788194444445]
["EKİNÖZÜ","2023-03-27",45012.205555555556,45012.788888888892]
["EKİNÖZÜ","2023-03-28",45013.20416666667,45013.789583333331]
["EKİNÖZÜ","2023-03-29",45014.203472222223,45014.790277777778]
["EKİNÖZÜ","2023-03-30",45015.20208333333,45015.790277777778]
["EKİNÖZÜ","2023-03-31",45016.200694444444,45016.790972222225]
["EKİNÖZÜ","2023-04-01",45017.2,45017.791666666664]
["EKİNÖZÜ","2023-04-02",45018.198611111111,45018.792361111111]
["EKİNÖZÜ","2023-04-03",45019.197222222225,45019.793055555558]
["EKİNÖZÜ","2023-04-04",45020.195833333331,45020.793749999997]
["EKİNÖZÜ","2023-04-05",45021.195138888892,45021.794444444444]
["EKİNÖZÜ","2023-04-06",45022.193749999999,45022.795138888891]
["EKİNÖZÜ","2023-04-07",45023.192361111112,45023.79583333333]
["EKİNÖZÜ","2023-04-08",45024.190972222219,45024.796527777777]
["EKİNÖZÜ","2023-04-09",45025.19027777778,45025.797222222223]
["EKİNÖZÜ","2023-04-10",45026.188888888886,45026.79791666667]
["EKİNÖZÜ","2023-04-11",45027.1875,45027.798611111109]
["EKİNÖZÜ","2023-04-12",45028.186805555553,45028.798611111109]
["EKİNÖZÜ","2023-04-13",45029.185416666667,45029.799305555556]
["EKİNÖZÜ","2023-04-14",45030.184027777781,45030.8]
["EKİNÖZÜ","2023-04-15",45031.182638888888,45031.800694444442]
["EKİNÖZÜ","2023-04-16",45032.181944444441,45032.801388888889]
["EKİNÖZÜ","2023-04-17",45033.180555555555,45033.802083333336]
["EKİNÖZÜ","2023-04-18",45034.179166666669,45034.802777777775]
["EKİNÖZÜ","2023-04-19",45035.177777777775,45035.803472222222]
["EKİNÖZÜ","2023-04-20",45036.177083333336,45036.804166666669]
["ELBİSTAN","2023-03-23",45008.210416666669,45008.786111111112]
["ELBİSTAN","2023-03-24",45009.209027777775,45009.786805555559]
["ELBİSTAN","2023-03-25",45010.207638888889,45010.787499999999]
["ELBİSTAN","2023-03-26",45011.206944444442,45011.788194444445]
["ELBİSTAN","2023-03-27",45012.205555555556,45012.788888888892]
["ELBİSTAN","2023-03-28",45013.20416666667,45013.789583333331]
["ELBİSTAN","2023-03-29",45014.202777777777,45014.790277777778]
["ELBİSTAN","2023-03-30",45015.20208333333,45015.790972222225]
["ELBİSTAN","2023-03-31",45016.200694444444,45016.790972222225]
["ELBİSTAN","2023-04-01",45017.199305555558,45017.791666666664]
["ELBİSTAN","2023-04-02",45018.198611111111,45018.792361111111]
["ELBİSTAN","2023-04-03",45019.197222222225,45019.793055555558]
["ELBİSTAN","2023-04-04",45020.195833333331,45020.793749999997]
["ELBİSTAN","2023-04-05",45021.194444444445,45021.794444444444]
["ELBİSTAN","2023-04-06",45022.193749999999,45022.795138888891]
["ELBİSTAN","2023-04-07",45023.192361111112,45023.79583333333]
["ELBİSTAN","2023-04-08",45024.190972222219,45024.796527777777]
["ELBİSTAN","2023-04-09",45025.189583333333,45025.797222222223]
["ELBİSTAN","2023-04-10",45026.188888888886,45026.79791666667]
["ELBİSTAN","2023-04-11",45027.1875,45027.798611111109]
["ELBİSTAN","2023-04-12",45028.186111111114,45028.799305555556]
["ELBİSTAN","2023-04-13",45029.18472222222,45029.8]
["ELBİSTAN","2023-04-14",45030.184027777781,45030.800694444442]
["ELBİSTAN","2023-04-15",45031.182638888888,45031.800694444442]
["ELBİSTAN","2023-04-16",45032.181250000001,45032.801388888889]
["ELBİSTAN","2023-04-17",45033.180555555555,45033.802083333336]
["ELBİSTAN","2023-04-18",45034.179166666669,45034.802777777775]
["ELBİSTAN","2023-04-19",45035.177777777775,45035.803472222222]
["ELBİSTAN","2023-04-20",45036.176388888889,45036.804166666669]
["GÖKSUN","2023-03-23",45008.212500000001,45008.788194444445]
["GÖKSUN","2023-03-24",45009.211111111108,45009.788888888892]
["GÖKSUN","2023-03-25",45010.209722222222,45010.789583333331]
["GÖKSUN","2023-03-26",45011.209027777775,45011.790277777778]
["GÖKSUN","2023-03-27",45012.207638888889,45012.790277777778]
["GÖKSUN","2023-03-28",45013.206250000003,45013.790972222225]
["GÖKSUN","2023-03-29",45014.205555555556,45014.791666666664]
["GÖKSUN","2023-03-30",45015.20416666667,45015.792361111111]
["GÖKSUN","2023-03-31",45016.202777777777,45016.793055555558]
["GÖKSUN","2023-04-01",45017.201388888891,45017.793749999997]
["GÖKSUN","2023-04-02",45018.200694444444,45018.794444444444]
["GÖKSUN","2023-04-03",45019.199305555558,45019.795138888891]
["GÖKSUN","2023-04-04",45020.197916666664,45020.79583333333]
["GÖKSUN","2023-04-05",45021.197222222225,45021.796527777777]
["GÖKSUN","2023-04-06",45022.195833333331,45022.797222222223]
["GÖKSUN","2023-04-07",45023.194444444445,45023.79791666667]
["GÖKSUN","2023-04-08",45024.193055555559,45024.798611111109]
["GÖKSUN","2023-04-09",45025.192361111112,45025.799305555556]
["GÖKSUN","2023-04-10",45026.190972222219,45026.799305555556]
["GÖKSUN","2023-04-11",45027.189583333333,45027.8]
["GÖKSUN","2023-04-12",45028.188194444447,45028.800694444442]
["GÖKSUN","2023-04-13",45029.1875,45029.801388888889]
["GÖKSUN","2023-04-14",45030.186111111114,45030.802083333336]
["GÖKSUN","2023-04-15",45031.18472222222,45031.802777777775]
["GÖKSUN","2023-04-16",45032.184027777781,45032.803472222222]
["GÖKSUN","2023-04-17",45033.182638888888,45033.804166666669]
["GÖKSUN","2023-04-18",45034.181250000001,45034.804861111108]
["GÖKSUN","2023-04-19",45035.179861111108,45035.805555555555]
["GÖKSUN","2023-04-20",45036.179166666669,45036.806250000001]
["KAHRAMANMARAŞ","2023-03-23",45008.211111111108,45008.786805555559]
["KAHRAMANMARAŞ","2023-03-24",45009.210416666669,45009.787499999999]
["KAHRAMANMARAŞ","2023-03-25",45010.209027777775,45010.788194444445]
["KAHRAMANMARAŞ","2023-03-26",45011.208333333336,45011.788888888892]
["KAHRAMANMARAŞ","2023-03-27",45012.206944444442,45012.789583333331]
["KAHRAMANMARAŞ","2023-03-28",45013.205555555556,45013.789583333331]
["KAHRAMANMARAŞ","2023-03-29",45014.204861111109,45014.790277777778]
["KAHRAMANMARAŞ","2023-03-30",45015.203472222223,45015.790972222225]
["KAHRAMANMARAŞ","2023-03-31",45016.20208333333,45016.791666666664]
["KAHRAMANMARAŞ","2023-04-01",45017.201388888891,45017.792361111111]
["KAHRAMANMARAŞ","2023-04-02",45018.2,45018.793055555558]
["KAHRAMANMARAŞ","2023-04-03",45019.198611111111,45019.793749999997]
["KAHRAMANMARAŞ","2023-04-04",45020.197222222225,45020.794444444444]
["KAHRAMANMARAŞ","2023-04-05",45021.196527777778,45021.795138888891]
["KAHRAMANMARAŞ","2023-04-06",45022.195138888892,45022.79583333333]
["KAHRAMANMARAŞ","2023-04-07",45023.193749999999,45023.796527777777]
["KAHRAMANMARAŞ","2023-04-08",45024.193055555559,45024.796527777777]
["KAHRAMANMARAŞ","2023-04-09",45025.191666666666,45025.797222222223]
["KAHRAMANMARAŞ","2023-04-10",45026.19027777778,45026.79791666667]
["KAHRAMANMARAŞ","2023-04-11",45027.188888888886,45027.798611111109]
["KAHRAMANMARAŞ","2023-04-12",45028.188194444447,45028.799305555556]
["KAHRAMANMARAŞ","2023-04-13",45029.186805555553,45029.8]
["KAHRAMANMARAŞ","2023-04-14",45030.185416666667,45030.800694444442]
["KAHRAMANMARAŞ","2023-04-15",45031.18472222222,45031.801388888889]
["KAHRAMANMARAŞ","2023-04-16",45032.183333333334,45032.802083333336]
["KAHRAMANMARAŞ","2023-04-17",45033.181944444441,45033.802777777775]
["KAHRAMANMARAŞ","2023-04-18",45034.181250000001,45034.802777777775]
["KAHRAMANMARAŞ","2023-04-19",45035.179861111108,45035.803472222222]
["KAHRAMANMARAŞ","2023-04-20",45036.178472222222,45036.804166666669]
["NURHAK","2023-03-23",45008.209722222222,45008.785416666666]
["NURHAK","2023-03-24",45009.208333333336,45009.786111111112]
["NURHAK","2023-03-25",45010.207638888889,45010.786805555559]
["NURHAK","2023-03-26",45011.206250000003,45011.787499999999]
["NURHAK","2023-03-27",45012.204861111109,45012.788194444445]
["NURHAK","2023-03-28",45013.20416666667,45013.788888888892]
["NURHAK","2023-03-29",45014.202777777777,45014.788888888892]
["NURHAK","2023-03-30",45015.201388888891,45015.789583333331]
["NURHAK","2023-03-31",45016.2,45016.790277777778]
["NURHAK","2023-04-01",45017.199305555558,45017.790972222225]
["NURHAK","2023-04-02",45018.197916666664,45018.791666666664]
["NURHAK","2023-04-03",45019.196527777778,45019.792361111111]
["NURHAK","2023-04-04",45020.195833333331,45020.793055555558]
["NURHAK","2023-04-05",45021.194444444445,45021.793749999997]
["NURHAK","2023-04-06",45022.193055555559,45022.794444444444]
["NURHAK","2023-04-07",45023.191666666666,45023.795138888891]
["NURHAK","2023-04-08",45024.190972222219,45024.79583333333]
["NURHAK","2023-04-09",45025.189583333333,45025.796527777777]
["NURHAK","2023-04-10",45026.188194444447,45026.797222222223]
["NURHAK","2023-04-11",45027.186805555553,45027.797222222223]
["NURHAK","2023-04-12",45028.186111111114,45028.79791666667]
["NURHAK","2023-04-13",45029.18472222222,45029.798611111109]
["NURHAK","2023-04-14",45030.183333333334,45030.799305555556]
["NURHAK","2023-04-15",45031.182638888888,45031.8]
["NURHAK","2023-04-16",45032.181250000001,45032.800694444442]
["NURHAK","2023-04-17",45033.179861111108,45033.801388888889]
["NURHAK","2023-04-18",45034.178472222222,45034.802083333336]
["NURHAK","2023-04-19",45035.177777777775,45035.802777777775]
["NURHAK","2023-04-20",45036.176388888889,45036.803472222222]
["PAZARCIK","2023-03-23",45008.210416666669,45008.785416666666]
["PAZARCIK","2023-03-24",45009.209722222222,45009.786111111112]
["PAZARCIK","2023-03-25",45010.208333333336,45010.786805555559]
["PAZARCIK","2023-03-26",45011.206944444442,45011.787499999999]
["PAZARCIK","2023-03-27",45012.206250000003,45012.788194444445]
["PAZARCIK","2023-03-28",45013.204861111109,45013.788888888892]
["PAZARCIK","2023-03-29",45014.203472222223,45014.789583333331]
["PAZARCIK","2023-03-30",45015.202777777777,45015.790277777778]
["PAZARCIK","2023-03-31",45016.201388888891,45016.790972222225]
["PAZARCIK","2023-04-01",45017.2,45017.791666666664]
["PAZARCIK","2023-04-02",45018.199305555558,45018.791666666664]
["PAZARCIK","2023-04-03",45019.197916666664,45019.792361111111]
["PAZARCIK","2023-04-04",45020.196527777778,45020.793055555558]
["PAZARCIK","2023-04-05",45021.195138888892,45021.793749999997]
["PAZARCIK","2023-04-06",45022.194444444445,45022.794444444444]
["PAZARCIK","2023-04-07",45023.193055555559,45023.795138888891]
["PAZARCIK","2023-04-08",45024.191666666666,45024.79583333333]
["PAZARCIK","2023-04-09",45025.190972222219,45025.796527777777]
["PAZARCIK","2023-04-10",45026.189583333333,45026.797222222223]
["PAZARCIK","2023-04-11",45027.188194444447,45027.79791666667]
["PAZARCIK","2023-04-12",45028.1875,45028.79791666667]
["PAZARCIK","2023-04-13",45029.186111111114,45029.798611111109]
["PAZARCIK","2023-04-14",45030.18472222222,45030.799305555556]
["PAZARCIK","2023-04-15",45031.183333333334,45031.8]
["PAZARCIK","2023-04-16",45032.182638888888,45032.800694444442]
["PAZARCIK","2023-04-17",45033.181250000001,45033.801388888889]
["PAZARCIK","2023-04-18",45034.179861111108,45034.802083333336]
["PAZARCIK","2023-04-19",45035.179166666669,45035.802777777775]
["PAZARCIK","2023-04-20",45036.177777777775,45036.803472222222]
["TÜRKOĞLU","2023-03-23",45008.211805555555,45008.786805555559]
["TÜRKOĞLU","2023-03-24",45009.210416666669,45009.787499999999]
["TÜRKOĞLU","2023-03-25",45010.209722222222,45010.788194444445]
["TÜRKOĞLU","2023-03-26",45011.208333333336,45011.788888888892]
["TÜRKOĞLU","2023-03-27",45012.207638888889,45012.789583333331]
["TÜRKOĞLU","2023-03-28",45013.206250000003,45013.790277777778]
["TÜRKOĞLU","2023-03-29",45014.204861111109,45014.790972222225]
["TÜRKOĞLU","2023-03-30",45015.20416666667,45015.791666666664]
["TÜRKOĞLU","2023-03-31",45016.202777777777,45016.791666666664]
["TÜRKOĞLU","2023-04-01",45017.201388888891,45017.792361111111]
["TÜRKOĞLU","2023-04-02",45018.200694444444,45018.793055555558]
["TÜRKOĞLU","2023-04-03",45019.199305555558,45019.793749999997]
["TÜRKOĞLU","2023-04-04",45020.197916666664,45020.794444444444]
["TÜRKOĞLU","2023-04-05",45021.196527777778,45021.795138888891]
["TÜRKOĞLU","2023-04-06",45022.195833333331,45022.79583333333]
["TÜRKOĞLU","2023-04-07",45023.194444444445,45023.796527777777]
["TÜRKOĞLU","2023-04-08",45024.193055555559,45024.797222222223]
["TÜRKOĞLU","2023-04-09",45025.192361111112,45025.797222222223]
["TÜRKOĞLU","2023-04-10",45026.190972222219,45026.79791666667]
["TÜRKOĞLU","2023-04-11",45027.189583333333,45027.798611111109]
["TÜRKOĞLU","2023-04-12",45028.188888888886,45028.799305555556]
["TÜRKOĞLU","2023-04-13",45029.1875,45029.8]
["TÜRKOĞLU","2023-04-14",45030.186111111114,45030.800694444442]
["TÜRKOĞLU","2023-04-15",45031.185416666667,45031.801388888889]
["TÜRKOĞLU","2023-04-16",45032.184027777781,45032.802083333336]
["TÜRKOĞLU","2023-04-17",45033.182638888888,45033.802777777775]
["TÜRKOĞLU","2023-04-18",45034.181944444441,45034.803472222222]
["TÜRKOĞLU","2023-04-19",45035.180555555555,45035.803472222222]
["TÜRKOĞLU","2023-04-20",45036.179166666669,45036.804166666669]

{"sheet":"İmsakiye","index":2,"n_rows":30,"n_cols":17,"rows_kept":30,"cut":false,"hidden":false,"merged":[[28,15,29,19]]}
["TARİH","ORUÇLU GÜN","KALAN GÜN","SAHUR VAKTİ","İFTAR VAKTİ","İFTARA KALAN SÜRE"]
["2023-03-23",1,{"$f":"29-B2","v":28},{"$f":"INDIRECT(\"Vakitler!C\"&Sabit!C3)","v":45008.213194444441},{"$f":"INDIRECT(\"Vakitler!D\"&Sabit!C3)","v":45008.788194444445},{"$f":"IF(NOW()>E2,\"Allah Kabul Etsin... :)\",IF(D2>NOW(),\"\",E2-NOW()))","v":"Allah Kabul Etsin... :)"}]
[{"$f":"A2+1","v":"2023-03-24"},2,27,{"$f":"INDIRECT(\"Vakitler!C\"&Sabit!$C$3+ROW(D1))","v":45009.211805555555},{"$f":"INDIRECT(\"Vakitler!D\"&Sabit!$C$3+ROW(E1))","v":45009.788888888892},{"$f":"IF(NOW()>E3,\"Allah Kabul Etsin... :)\",IF(D3>NOW(),\"\",E3-NOW()))","v":"Allah Kabul Etsin... :)"}]
[{"$f":"A3+1","v":"2023-03-25"},3,26,{"$f":"INDIRECT(\"Vakitler!C\"&Sabit!$C$3+ROW(D2))","v":45010.211111111108},{"$f":"INDIRECT(\"Vakitler!D\"&Sabit!$C$3+ROW(E2))","v":45010.789583333331},"Allah Kabul Etsin... :)"]
["2023-03-26",4,25,{"$f":"INDIRECT(\"Vakitler!C\"&Sabit!$C$3+ROW(D3))","v":45011.209722222222},{"$f":"INDIRECT(\"Vakitler!D\"&Sabit!$C$3+ROW(E3))","v":45011.790277777778},"07:00:40.720"]
["2023-03-27",5,24,{"$f":"INDIRECT(\"Vakitler!C\"&Sabit!$C$3+ROW(D4))","v":45012.208333333336},{"$f":"INDIRECT(\"Vakitler!D\"&Sabit!$C$3+ROW(E4))","v":45012.790972222225},""]
["2023-03-28",6,23,{"$f":"INDIRECT(\"Vakitler!C\"&Sabit!$C$3+ROW(D5))","v":45013.207638888889},{"$f":"INDIRECT(\"Vakitler!D\"&Sabit!$C$3+ROW(E5))","v":45013.791666666664},""]
["2023-03-29",7,22,{"$f":"INDIRECT(\"Vakitler!C\"&Sabit!$C$3+ROW(D6))","v":45014.206250000003},{"$f":"INDIRECT(\"Vakitler!D\"&Sabit!$C$3+ROW(E6))","v":45014.792361111111},""]
["2023-03-30",8,21,{"$f":"INDIRECT(\"Vakitler!C\"&Sabit!$C$3+ROW(D7))","v":45015.204861111109},{"$f":"INDIRECT(\"Vakitler!D\"&Sabit!$C$3+ROW(E7))","v":45015.793055555558},""]
["2023-03-31",9,20,{"$f":"INDIRECT(\"Vakitler!C\"&Sabit!$C$3+ROW(D8))","v":45016.20416666667},{"$f":"INDIRECT(\"Vakitler!D\"&Sabit!$C$3+ROW(E8))","v":45016.793749999997},""]
["2023-04-01",10,19,{"$f":"INDIRECT(\"Vakitler!C\"&Sabit!$C$3+ROW(D9))","v":45017.202777777777},{"$f":"INDIRECT(\"Vakitler!D\"&Sabit!$C$3+ROW(E9))","v":45017.793749999997},""]
["2023-04-02",11,18,{"$f":"INDIRECT(\"Vakitler!C\"&Sabit!$C$3+ROW(D10))","v":45018.201388888891},{"$f":"INDIRECT(\"Vakitler!D\"&Sabit!$C$3+ROW(E10))","v":45018.794444444444},""]
["2023-04-03",12,17,{"$f":"INDIRECT(\"Vakitler!C\"&Sabit!$C$3+ROW(D11))","v":45019.199999999997},{"$f":"INDIRECT(\"Vakitler!D\"&Sabit!$C$3+ROW(E11))","v":45019.795138888891},""]
["2023-04-04",13,16,{"$f":"INDIRECT(\"Vakitler!C\"&Sabit!$C$3+ROW(D12))","v":45020.199305555558},{"$f":"INDIRECT(\"Vakitler!D\"&Sabit!$C$3+ROW(E12))","v":45020.79583333333},""]
["2023-04-05",14,15,{"$f":"INDIRECT(\"Vakitler!C\"&Sabit!$C$3+ROW(D13))","v":45021.197916666664},{"$f":"INDIRECT(\"Vakitler!D\"&Sabit!$C$3+ROW(E13))","v":45021.796527777777},""]
["2023-04-06",15,14,{"$f":"INDIRECT(\"Vakitler!C\"&Sabit!$C$3+ROW(D14))","v":45022.196527777778},{"$f":"INDIRECT(\"Vakitler!D\"&Sabit!$C$3+ROW(E14))","v":45022.797222222223},""]
["2023-04-07",16,13,{"$f":"INDIRECT(\"Vakitler!C\"&Sabit!$C$3+ROW(D15))","v":45023.195833333331},{"$f":"INDIRECT(\"Vakitler!D\"&Sabit!$C$3+ROW(E15))","v":45023.79791666667},""]
["2023-04-08",17,12,{"$f":"INDIRECT(\"Vakitler!C\"&Sabit!$C$3+ROW(D16))","v":45024.194444444445},{"$f":"INDIRECT(\"Vakitler!D\"&Sabit!$C$3+ROW(E16))","v":45024.798611111109},""]
["2023-04-09",18,11,{"$f":"INDIRECT(\"Vakitler!C\"&Sabit!$C$3+ROW(D17))","v":45025.193055555559},{"$f":"INDIRECT(\"Vakitler!D\"&Sabit!$C$3+ROW(E17))","v":45025.799305555556},""]
["2023-04-10",19,10,{"$f":"INDIRECT(\"Vakitler!C\"&Sabit!$C$3+ROW(D18))","v":45026.192361111112},{"$f":"INDIRECT(\"Vakitler!D\"&Sabit!$C$3+ROW(E18))","v":45026.8},""]
["2023-04-11",20,9,{"$f":"INDIRECT(\"Vakitler!C\"&Sabit!$C$3+ROW(D19))","v":45027.190972222219},{"$f":"INDIRECT(\"Vakitler!D\"&Sabit!$C$3+ROW(E19))","v":45027.8},""]
["2023-04-12",21,8,{"$f":"INDIRECT(\"Vakitler!C\"&Sabit!$C$3+ROW(D20))","v":45028.189583333333},{"$f":"INDIRECT(\"Vakitler!D\"&Sabit!$C$3+ROW(E20))","v":45028.800694444442},"",null,null,null,null,null,null,null,null,null,null,{"$f":"Sabit!E2","v":"FİTRE BEDELİ: 70 TL"}]
["2023-04-13",22,7,{"$f":"INDIRECT(\"Vakitler!C\"&Sabit!$C$3+ROW(D21))","v":45029.188194444447},{"$f":"INDIRECT(\"Vakitler!D\"&Sabit!$C$3+ROW(E21))","v":45029.801388888889},""]
["2023-04-14",23,6,{"$f":"INDIRECT(\"Vakitler!C\"&Sabit!$C$3+ROW(D22))","v":45030.1875},{"$f":"INDIRECT(\"Vakitler!D\"&Sabit!$C$3+ROW(E22))","v":45030.802083333336},""]
["2023-04-15",24,5,{"$f":"INDIRECT(\"Vakitler!C\"&Sabit!$C$3+ROW(D23))","v":45031.186111111114},{"$f":"INDIRECT(\"Vakitler!D\"&Sabit!$C$3+ROW(E23))","v":45031.802777777775},""]
["2023-04-16",25,4,{"$f":"INDIRECT(\"Vakitler!C\"&Sabit!$C$3+ROW(D24))","v":45032.18472222222},{"$f":"INDIRECT(\"Vakitler!D\"&Sabit!$C$3+ROW(E24))","v":45032.803472222222},""]
["2023-04-17",26,3,{"$f":"INDIRECT(\"Vakitler!C\"&Sabit!$C$3+ROW(D25))","v":45033.184027777781},{"$f":"INDIRECT(\"Vakitler!D\"&Sabit!$C$3+ROW(E25))","v":45033.804166666669},""]
["2023-04-18",27,2,{"$f":"INDIRECT(\"Vakitler!C\"&Sabit!$C$3+ROW(D26))","v":45034.182638888888},{"$f":"INDIRECT(\"Vakitler!D\"&Sabit!$C$3+ROW(E26))","v":45034.804861111108},""]
["2023-04-19",28,1,{"$f":"INDIRECT(\"Vakitler!C\"&Sabit!$C$3+ROW(D27))","v":45035.181250000001},{"$f":"INDIRECT(\"Vakitler!D\"&Sabit!$C$3+ROW(E27))","v":45035.805555555555},"",null,null,null,null,null,null,null,null,null,{"$f":"NOW()","v":"2023-03-26T11:57:19.280"}]
["2023-04-20",29,0,{"$f":"INDIRECT(\"Vakitler!C\"&Sabit!$C$3+ROW(D28))","v":45036.180555555555},{"$f":"INDIRECT(\"Vakitler!D\"&Sabit!$C$3+ROW(E28))","v":45036.806250000001},""]