{"text_format":"1","workbook":"xlsx","n_sheets":3,"sheets":["Sabit","Vakitler","İmsakiye"],"not_rendered":{"charts":2,"images":6,"macros":1,"external_links":0,"defined_names":0,"comments":1,"pivot_tables":0},"unopened":[],"bounds":{"document_bytes":16777216,"sheet_cells":100000,"rows_first":2000,"rows_last":500,"rows_between":2000,"halvings":0,"cell_chars":16384,"cell_head_chars":4096},"cells_cut":0,"cells_raw":0,"read":"whole","date_system":"1900"}

{"sheet":"Sabit","index":0,"n_rows":22,"n_cols":9,"rows_kept":22,"cut":false,"hidden":true,"merged":[]}
["ILCELER","Bayram Namazı","Seçimler",null,"Fitre Bedeli","Bayram Günü","Kadir Gecesi","Bayram saati","ilce Aktif"]
["ALİAĞA",null,"İZMİR","Şehir","Fitre Bedeli:130 TL","10 Nisan 2024 Çarşamba","05 Nisan 2024 Cuma","07:13:00","DİKİLİ"]
["BAYINDIR",null,{"$f":"MATCH(C2,Vakitler!A:A,0)","v":{"$error":"#N/A"}},"Satır"]
["BERGAMA",null,{"$f":"VLOOKUP(C2,A:B,2,0)","v":"00:00:00"},"Namaz"]
["BEYDAĞ"]
["CEŞME",null,"Günlük",{"$f":"TODAY()","v":"2024-03-05"}]
["DİKİLİ",null,{"$f":"NOW()","v":45356.299145949073},"bugün"]
["FOÇA",null,{"$f":"IFERROR(VLOOKUP(D6,İmsakiye!A:B,2,0)+1,0)","v":0},"Gün Satır"]
["GÜZELBAHÇE",null,{"$f":"IFERROR(INDIRECT(\"İmsakiye!E\"&C8),0)","v":"00:00:00"},"iftar"]
["İZMİR",null,{"$f":"IFERROR(INDIRECT(\"İmsakiye!D\"&C8),0)","v":"00:00:00"},"sahur"]
["KARABURUN",null,{"$f":"IF(C7>C9,C9-C10,C7-C10)","v":"00:00:00"},"Tutulan Süre"]
["KEMALPAŞA",null,{"$f":"IF(C7>C9,0,C9-C7)","v":"00:00:00"},"Kalan Süre"]
["KINIK",null,{"$f":"IF(C8=0,0,C8-1)","v":0},"Tutulan Gün"]
["KİRAZ",null,{"$f":"30-C13","v":30},"Kalan Gün"]
["MENDERES"]
["MENEMEN"]
["ÖDEMİŞ"]
["SEFERIHİSAR"]
["SELÇUK"]
["TİRE"]
["TORBALI"]
["URLA"]

{"sheet":"Vakitler","index":1,"n_rows":1,"n_cols":5,"rows_kept":1,"cut":false,"hidden":true,"merged":[]}
["İL","Tarih","Sahur","İftar","Yatsı "]

{"sheet":"İmsakiye","index":2,"n_rows":34,"n_cols":17,"rows_kept":34,"cut":false,"hidden":false,"merged":[[28,15,29,19]]}
["TARİH","ORUÇLU GÜN","KALAN GÜN","SAHUR VAKTİ","İFTAR VAKTİ","İFTARA KALAN SÜRE","TERAVİH VAKTİ"]
["2024-03-11",1,30,45362.250694444447,45362.806944444441,{"$f":"IF(A2=\"\",\"\",IF(NOW()>E2,\"Allah Kabul Etsin... :)\",IF(D2>NOW(),\"\",E2-NOW())))","v":""},45362.86041666667]
["2024-03-12",2,29,45363.249305555553,45363.807638888888,{"$f":"IF(A3=\"\",\"\",IF(NOW()>E3,\"Allah Kabul Etsin... :)\",IF(D3>NOW(),\"\",E3-NOW())))","v":""},45363.861111111109]
["2024-03-13",3,28,45364.248611111114,45364.808333333334,"",45364.861805555556]
["2024-03-14",4,27,45365.24722222222,45365.809027777781,"",45365.862500000003]
["2024-03-15",5,26,45366.246527777781,45366.80972222222,"",45366.863194444442]
["2024-03-16",6,25,45367.245138888888,45367.810416666667,"",45367.863888888889]
["2024-03-17",7,24,45368.243750000001,45368.811111111114,"",45368.864583333336]
["2024-03-18",8,23,45369.243055555555,45369.811805555553,"",45369.865277777775]
["2024-03-19",9,22,45370.241666666669,45370.8125,"",45370.865972222222]
["2024-03-20",10,21,45371.240277777775,45371.813194444447,"",45371.866666666669]
["2024-03-21",11,20,45372.239583333336,45372.813888888886,"",45372.867361111108]
["2024-03-22",12,19,45373.238194444442,45373.814583333333,"",45373.868055555555]
["2024-03-23",13,18,45374.236805555556,45374.81527777778,"",45374.869444444441]
["2024-03-24",14,17,45375.23541666667,45375.815972222219,"",45375.870138888888]
["2024-03-25",15,16,45376.234722222223,45376.816666666666,"",45376.870833333334]
["2024-03-26",16,15,45377.23333333333,45377.817361111112,"",45377.871527777781]
["2024-03-27",17,14,45378.231944444444,45378.818055555559,"",45378.87222222222]
["2024-03-28",18,13,45379.230555555558,45379.818749999999,"",45379.872916666667]
["2024-03-29",19,12,45380.229861111111,45380.819444444445,"",45380.873611111114]
["2024-03-30",20,11,45381.228472222225,45381.820138888892,"",45381.874305555553]
["2024-03-31",21,10,45382.227083333331,45382.820833333331,"",45382.875694444447,null,null,null,null,null,null,null,null,null,{"$f":"Sabit!E2","v":"Fitre Bedeli:130 TL"}]
["2024-04-01",22,9,45383.225694444445,45383.821527777778,"",45383.876388888886]
["2024-04-02",23,8,45384.224999999999,45384.822222222225,"",45384.877083333333]
["2024-04-03",24,7,45385.223611111112,45385.822916666664,"",45385.87777777778]
["2024-04-04",25,6,45386.222222222219,45386.823611111111,"",45386.878472222219]
["2024-04-05",26,5,45387.220833333333,45387.824305555558,"",45387.879166666666]
["2024-04-06",27,4,45388.219444444447,45388.824999999997,"",45388.880555555559]
["2024-04-07",28,3,45389.21875,45389.825694444444,"",45389.881249999999,null,null,null,null,null,null,null,null,{"$f":"NOW()","v":"2024-03-05T07:10:46.210"}]
["2024-04-08",29,2,45390.217361111114,45390.826388888891,"",45390.881944444445]
["2024-04-09",30,1,45391.21597222222,45391.82708333333,{"$f":"IF(A31=\"\",\"\",IF(NOW()>E31,\"Allah Kabul Etsin... :)\",IF(D31>NOW(),\"\",E31-NOW())))","v":""},45391.882638888892]
[null,null,null,null,null,""]
[null,null,null,null,null,""]
[null,null,"İZMİR >>>>> DİKİLİ İmsakiye"]