{"text_format":"1","workbook":"xlsx","n_sheets":3,"sheets":["Sabit","Vakitler","İmsakiye"],"not_rendered":{"charts":2,"images":6,"macros":1,"external_links":0,"defined_names":0,"comments":1,"pivot_tables":0},"unopened":[],"bounds":{"document_bytes":16777216,"sheet_cells":100000,"rows_first":2000,"rows_last":500,"rows_between":2000,"halvings":0,"cell_chars":16384,"cell_head_chars":4096},"cells_cut":0,"cells_raw":0,"read":"whole","date_system":"1900"}

{"sheet":"Sabit","index":0,"n_rows":14,"n_cols":9,"rows_kept":14,"cut":false,"hidden":true,"merged":[]}
["ILCELER","Bayram Namazı","Seçimler",null,"Fitre Bedeli","Bayram Günü","Kadir Gecesi","Bayram saati","ilce Aktif"]
["AYRANCI",null,"KARAMAN","Şehir",null," 30 Mart 2025 Pazar","26 Mart 2025 Çarşamba","07:08:00","BAŞYAYLA"]
["BAŞYAYLA",null,{"$f":"MATCH(C2,Vakitler!A:A,0)","v":{"$error":"#N/A"}},"Satır"]
["ERMENEK",null,{"$f":"VLOOKUP(C2,A:B,2,0)","v":"00:00:00"},"Namaz"]
["KARAMAN"]
["KAZIMKARABEKİR",null,"Günlük",{"$f":"TODAY()","v":"2025-02-13"}]
["SARIVELİLER",null,{"$f":"NOW()","v":45701.321013657405},"bugün"]
[null,null,{"$f":"IFERROR(VLOOKUP(D6,İmsakiye!A:B,2,0)+1,0)","v":0},"Gün Satır"]
[null,null,{"$f":"IFERROR(INDIRECT(\"İmsakiye!E\"&C8),0)","v":"00:00:00"},"iftar"]
[null,null,{"$f":"IFERROR(INDIRECT(\"İmsakiye!D\"&C8),0)","v":"00:00:00"},"sahur"]
[null,null,{"$f":"IF(C7>C9,C9-C10,C7-C10)","v":"00:00:00"},"Tutulan Süre"]
[null,null,{"$f":"IF(C7>C9,0,C9-C7)","v":"00:00:00"},"Kalan Süre"]
[null,null,{"$f":"IF(C8=0,0,C8-1)","v":0},"Tutulan Gün"]
[null,null,{"$f":"29-C13","v":29},"Kalan Gün"]

{"sheet":"Vakitler","index":1,"n_rows":1,"n_cols":5,"rows_kept":1,"cut":false,"hidden":true,"merged":[]}
["İL","Tarih","Sahur","İftar","Yatsı "]

{"sheet":"İmsakiye","index":2,"n_rows":34,"n_cols":14,"rows_kept":34,"cut":false,"hidden":false,"merged":[[9,13,10,17]]}
["TARİH","ORUÇLU GÜN","KALAN GÜN","SAHUR VAKTİ","İFTAR VAKTİ","İFTARA KALAN SÜRE","TERAVİH VAKTİ"]
["2025-03-01",1,29,45717.245833333334,45717.784722222219,{"$f":"IF(A2=\"\",\"\",IF(NOW()>E2,\"Allah Kabul Etsin... :)\",IF(D2>NOW(),\"\",E2-NOW())))","v":""},45717.836111111108]
["2025-03-02",2,28,45718.245138888888,45718.785416666666,{"$f":"IF(A3=\"\",\"\",IF(NOW()>E3,\"Allah Kabul Etsin... :)\",IF(D3>NOW(),\"\",E3-NOW())))","v":""},45718.836805555555]
["2025-03-03",3,27,45719.244444444441,45719.786111111112,"",45719.837500000001]
["2025-03-04",4,26,45720.243055555555,45720.786805555559,"",45720.838194444441]
["2025-03-05",5,25,45721.242361111108,45721.787499999999,"",45721.838888888888]
["2025-03-06",6,24,45722.240972222222,45722.788194444445,"",45722.839583333334]
["2025-03-07",7,23,45723.240277777775,45723.788888888892,"",45723.840277777781]
["2025-03-08",8,22,45724.239583333336,45724.789583333331,"",45724.84097222222]
["2025-03-09",9,21,45725.238194444442,45725.790277777778,"",45725.841666666667,null,null,null,null,null,null,{"$f":"NOW()","v":"2025-02-13T07:42:15.580"}]
["2025-03-10",10,20,45726.237500000003,45726.790972222225,"",45726.841666666667]
["2025-03-11",11,19,45727.236111111109,45727.790972222225,"",45727.842361111114,null,null,null,null,null,null,"FİTRE BEDELİ 180 TL"]
["2025-03-12",12,18,45728.23541666667,45728.791666666664,"",45728.843055555553]
["2025-03-13",13,17,45729.234027777777,45729.792361111111,"",45729.84375]
["2025-03-14",14,16,45730.23333333333,45730.793055555558,"",45730.844444444447]
["2025-03-15",15,15,45731.231944444444,45731.793749999997,"",45731.845138888886]
["2025-03-16",16,14,45732.231249999997,45732.794444444444,"",45732.845833333333]
["2025-03-17",17,13,45733.229861111111,45733.795138888891,"",45733.84652777778]
["2025-03-18",18,12,45734.229166666664,45734.79583333333,"",45734.847222222219]
["2025-03-19",19,11,45735.227777777778,45735.796527777777,"",45735.847916666666]
["2025-03-20",20,10,45736.227083333331,45736.797222222223,"",45736.848611111112]
["2025-03-21",21,9,45737.225694444445,45737.797222222223,"",45737.849305555559]
["2025-03-22",22,8,45738.224305555559,45738.79791666667,"",45738.85]
["2025-03-23",23,7,45739.223611111112,45739.798611111109,"",45739.850694444445]
["2025-03-24",24,6,45740.222222222219,45740.799305555556,"",45740.851388888892]
["2025-03-25",25,5,45741.22152777778,45741.8,"",45741.852083333331]
["2025-03-26",26,4,45742.220138888886,45742.800694444442,"",45742.852777777778]
["2025-03-27",27,3,45743.21875,45743.801388888889,"",45743.853472222225]
["2025-03-28",28,2,45744.218055555553,45744.802083333336,"",45744.854166666664]
["2025-03-29",29,1,45745.216666666667,45745.802083333336,"",45745.854861111111]
[null,null,null,null,null,{"$f":"IF(A31=\"\",\"\",IF(NOW()>E31,\"Allah Kabul Etsin... :)\",IF(D31>NOW(),\"\",E31-NOW())))","v":""}]
[null,null,null,null,null,""]
[null,null,null,null,null,""]
[null,null,"KARAMAN >>>>> BAŞYAYLA İmsakiye"]