{"text_format":"1","workbook":"xlsx","n_sheets":3,"sheets":["Sabit","Vakitler","İmsakiye"],"not_rendered":{"charts":2,"images":7,"macros":1,"external_links":0,"defined_names":0,"comments":1,"pivot_tables":0},"unopened":[],"bounds":{"document_bytes":16777216,"sheet_cells":100000,"rows_first":2000,"rows_last":500,"rows_between":2000,"halvings":0,"cell_chars":16384,"cell_head_chars":4096},"cells_cut":0,"cells_raw":0,"read":"whole","date_system":"1900"}

{"sheet":"Sabit","index":0,"n_rows":14,"n_cols":9,"rows_kept":14,"cut":false,"hidden":true,"merged":[]}
["ILCELER","Bayram Namazı","Seçimler",null,"Fitre Bedeli","Bayram Günü","Kadir Gecesi","Bayram saati","ilce Aktif"]
[null,null,null,"Şehir"]
[null,null,{"$f":"MATCH(C2,Vakitler!A:A,0)","v":{"$error":"#N/A"}},"Satır"]
[null,null,{"$f":"VLOOKUP(C2,A:B,2,0)","v":{"$error":"#N/A"}},"Namaz"]
[]
[null,null,"Günlük",{"$f":"TODAY()","v":"2025-02-08"}]
[null,null,{"$f":"NOW()","v":45696.899497337959},"bugün"]
[null,null,{"$f":"IFERROR(VLOOKUP(D6,İmsakiye!A:B,2,0)+1,0)","v":0},"Gün Satır"]
[null,null,{"$f":"IFERROR(INDIRECT(\"İmsakiye!E\"&C8),0)","v":"00:00:00"},"iftar"]
[null,null,{"$f":"IFERROR(INDIRECT(\"İmsakiye!D\"&C8),0)","v":"00:00:00"},"sahur"]
[null,null,{"$f":"IF(C7>C9,C9-C10,C7-C10)","v":"00:00:00"},"Tutulan Süre"]
[null,null,{"$f":"IF(C7>C9,0,C9-C7)","v":"00:00:00"},"Kalan Süre"]
[null,null,{"$f":"IF(C8=0,0,C8-1)","v":0},"Tutulan Gün"]
[null,null,{"$f":"29-C13","v":29},"Kalan Gün"]

{"sheet":"Vakitler","index":1,"n_rows":1,"n_cols":5,"rows_kept":1,"cut":false,"hidden":true,"merged":[]}
["İL","Tarih","Sahur","İftar","Yatsı "]

{"sheet":"İmsakiye","index":2,"n_rows":12,"n_cols":14,"rows_kept":12,"cut":false,"hidden":false,"merged":[[9,13,10,17]]}
["TARİH","ORUÇLU GÜN","KALAN GÜN","SAHUR VAKTİ","İFTAR VAKTİ","İFTARA KALAN SÜRE","TERAVİH VAKTİ"]
[]
[]
[]
[]
[]
[]
[]
[]
[null,null,null,null,null,null,null,null,null,null,null,null,null,{"$f":"NOW()","v":"2025-02-08T21:35:16.570"}]
[]
[null,null,null,null,null,null,null,null,null,null,null,null,null,"FİTRE BEDELİ 180 TL"]